Target
Vesicular acetylcholine transporter
Ligand
BDBM50351979
Substrate
Meas. Tech.
ChEMBL_765941 (CHEMBL1827957)
Ki
136±n/a nM
Citation
 Wang, WCui, JLu, XPadakanti, PKXu, JParsons, SMLuedtke, RRRath, NPTu, Z Synthesis and in vitro biological evaluation of carbonyl group-containing analogues fors1 receptors. J Med Chem 54:5362-72 (2011)  
Target
Name:
Vesicular acetylcholine transporter
Synonyms:
SLC18A3 VACHT | VACHT_HUMAN
Type:
PROTEIN
Mol. Mass.:
56900.67
Organism:
Homo sapiens (Human)
Description:
ChEMBL_1507628
Residue:
532
  
Inhibitor
Name:
BDBM50351979
Synonyms:
CHEMBL1822401
Type:
Small organic molecule
Emp. Form.:
C24H28F2N2O2
Mol. Mass.:
414.4881
SMILES:
O[C@H]1CCN(Cc2ccc(F)cc2)C[C@@H]1N1CCC(CC1)C(=O)c1ccc(F)cc1
: