Target
Vesicular acetylcholine transporter
Ligand
BDBM50351980
Substrate
Meas. Tech.
ChEMBL_765941 (CHEMBL1827957)
Ki
1970±n/a nM
Citation
 Wang, WCui, JLu, XPadakanti, PKXu, JParsons, SMLuedtke, RRRath, NPTu, Z Synthesis and in vitro biological evaluation of carbonyl group-containing analogues fors1 receptors. J Med Chem 54:5362-72 (2011)  
Target
Name:
Vesicular acetylcholine transporter
Synonyms:
SLC18A3 VACHT | VACHT_HUMAN
Type:
PROTEIN
Mol. Mass.:
56900.67
Organism:
Homo sapiens (Human)
Description:
ChEMBL_1507628
Residue:
532
  
Inhibitor
Name:
BDBM50351980
Synonyms:
CHEMBL1822402
Type:
Small organic molecule
Emp. Form.:
C25H31FN2O3
Mol. Mass.:
426.5236
SMILES:
COc1ccc(CN2CC[C@H](O)[C@H](C2)N2CCC(CC2)C(=O)c2ccc(F)cc2)cc1
: