Target
Vesicular acetylcholine transporter
Ligand
BDBM50351983
Substrate
Meas. Tech.
ChEMBL_765941 (CHEMBL1827957)
Ki
49±n/a nM
Citation
 Wang, WCui, JLu, XPadakanti, PKXu, JParsons, SMLuedtke, RRRath, NPTu, Z Synthesis and in vitro biological evaluation of carbonyl group-containing analogues fors1 receptors. J Med Chem 54:5362-72 (2011)  
Target
Name:
Vesicular acetylcholine transporter
Synonyms:
SLC18A3 VACHT | VACHT_HUMAN
Type:
PROTEIN
Mol. Mass.:
56900.67
Organism:
Homo sapiens (Human)
Description:
ChEMBL_1507628
Residue:
532
  
Inhibitor
Name:
BDBM50351983
Synonyms:
CHEMBL1822405
Type:
Small organic molecule
Emp. Form.:
C25H31FN2O3
Mol. Mass.:
426.5236
SMILES:
COc1ccc(cc1)C(=O)C1CCN(CC1)[C@H]1CN(Cc2ccc(F)cc2)CC[C@@H]1O
: