Target
D(2) dopamine receptor
Ligand
BDBM50351964
Substrate
Meas. Tech.
ChEMBL_765942 (CHEMBL1827958)
Ki
1350±n/a nM
Citation
 Wang, WCui, JLu, XPadakanti, PKXu, JParsons, SMLuedtke, RRRath, NPTu, Z Synthesis and in vitro biological evaluation of carbonyl group-containing analogues fors1 receptors. J Med Chem 54:5362-72 (2011)  
Target
Name:
D(2) dopamine receptor
Synonyms:
D(2) dopamine receptor DOPAMINE D2 Long DRD2 Dopamine D2 receptor Dopamine D2 receptor (D2R) Dopamine2-like | d2
Type:
Cell-surface receptors
Mol. Mass.:
50647.10
Organism:
Homo sapiens (Human)
Description:
P14416
Residue:
443
  
Inhibitor
Name:
BDBM50351964
Synonyms:
CHEMBL1822386
Type:
Small organic molecule
Emp. Form.:
C24H28F2N2O2
Mol. Mass.:
414.4881
SMILES:
O[C@H]1CN(Cc2ccc(F)cc2)CC[C@@H]1N1CCC(CC1)C(=O)c1ccc(F)cc1
: