Target
D(2) dopamine receptor
Ligand
BDBM50351968
Substrate
Meas. Tech.
ChEMBL_765942 (CHEMBL1827958)
Ki
1489±n/a nM
Citation
 Wang, WCui, JLu, XPadakanti, PKXu, JParsons, SMLuedtke, RRRath, NPTu, Z Synthesis and in vitro biological evaluation of carbonyl group-containing analogues fors1 receptors. J Med Chem 54:5362-72 (2011)  
Target
Name:
D(2) dopamine receptor
Synonyms:
D(2) dopamine receptor DOPAMINE D2 Long DRD2 Dopamine D2 receptor Dopamine D2 receptor (D2R) Dopamine2-like | d2
Type:
Cell-surface receptors
Mol. Mass.:
50647.10
Organism:
Homo sapiens (Human)
Description:
P14416
Residue:
443
  
Inhibitor
Name:
BDBM50351968
Synonyms:
CHEMBL1822390
Type:
Small organic molecule
Emp. Form.:
C25H31FN2O3
Mol. Mass.:
426.5236
SMILES:
COc1ccc(cc1)C(=O)C1CCN(CC1)[C@H]1CCN(Cc2ccc(F)cc2)C[C@@H]1O
: