Target
5-hydroxytryptamine receptor 1A
Ligand
BDBM50351964
Substrate
Meas. Tech.
ChEMBL_765946 (CHEMBL1827962)
Ki
2540±n/a nM
Citation
 Wang, WCui, JLu, XPadakanti, PKXu, JParsons, SMLuedtke, RRRath, NPTu, Z Synthesis and in vitro biological evaluation of carbonyl group-containing analogues fors1 receptors. J Med Chem 54:5362-72 (2011)  
Target
Name:
5-hydroxytryptamine receptor 1A
Synonyms:
5-HT-1A 5-hydroxytryptamine receptor 1A (5-HT-1A) ADRB2RL1 Dopamine D2 receptor and serotonin 1a receptor HTR1A | Serotonin receptor 1A
Type:
Mol. Mass.:
46122.49
Organism:
Homo sapiens (Human)
Description:
Residue:
422
  
Inhibitor
Name:
BDBM50351964
Synonyms:
CHEMBL1822386
Type:
Small organic molecule
Emp. Form.:
C24H28F2N2O2
Mol. Mass.:
414.4881
SMILES:
O[C@H]1CN(Cc2ccc(F)cc2)CC[C@@H]1N1CCC(CC1)C(=O)c1ccc(F)cc1
: