Target
Sigma non-opioid intracellular receptor 1
Ligand
BDBM50351964
Substrate
Meas. Tech.
ChEMBL_765939 (CHEMBL1827955)
Ki
0.480000±n/a nM
Citation
 Wang, WCui, JLu, XPadakanti, PKXu, JParsons, SMLuedtke, RRRath, NPTu, Z Synthesis and in vitro biological evaluation of carbonyl group-containing analogues fors1 receptors. J Med Chem 54:5362-72 (2011)  
Target
Name:
Sigma non-opioid intracellular receptor 1
Synonyms:
OPRS1 SIGMAR1 Sigma non-opioid intracellular receptor 1 Sigma1-receptor Sterol isomerase-like protein
Type:
Protein
Mol. Mass.:
25307.17
Organism:
Cavia porcellus (Guinea pig)
Description:
Q60492
Residue:
223
  
Inhibitor
Name:
BDBM50351964
Synonyms:
CHEMBL1822386
Type:
Small organic molecule
Emp. Form.:
C24H28F2N2O2
Mol. Mass.:
414.4881
SMILES:
O[C@H]1CN(Cc2ccc(F)cc2)CC[C@@H]1N1CCC(CC1)C(=O)c1ccc(F)cc1
: