Target
Sigma non-opioid intracellular receptor 1
Ligand
BDBM50351971
Substrate
Meas. Tech.
ChEMBL_765939 (CHEMBL1827955)
Ki
60±n/a nM
Citation
 Wang, WCui, JLu, XPadakanti, PKXu, JParsons, SMLuedtke, RRRath, NPTu, Z Synthesis and in vitro biological evaluation of carbonyl group-containing analogues fors1 receptors. J Med Chem 54:5362-72 (2011)  
Target
Name:
Sigma non-opioid intracellular receptor 1
Synonyms:
OPRS1 SIGMAR1 Sigma non-opioid intracellular receptor 1 Sigma1-receptor Sterol isomerase-like protein
Type:
Protein
Mol. Mass.:
25307.17
Organism:
Cavia porcellus (Guinea pig)
Description:
Q60492
Residue:
223
  
Inhibitor
Name:
BDBM50351971
Synonyms:
CHEMBL1822393
Type:
Small organic molecule
Emp. Form.:
C24H31N3O3
Mol. Mass.:
409.5212
SMILES:
COc1ccc(cc1)C(=O)C1CCN(CC1)[C@H]1CCN(Cc2cccnc2)C[C@@H]1O
: