Target
Sigma non-opioid intracellular receptor 1
Ligand
BDBM50351977
Substrate
Meas. Tech.
ChEMBL_765939 (CHEMBL1827955)
Ki
2061±n/a nM
Citation
 Wang, WCui, JLu, XPadakanti, PKXu, JParsons, SMLuedtke, RRRath, NPTu, Z Synthesis and in vitro biological evaluation of carbonyl group-containing analogues fors1 receptors. J Med Chem 54:5362-72 (2011)  
Target
Name:
Sigma non-opioid intracellular receptor 1
Synonyms:
OPRS1 SIGMAR1 Sigma non-opioid intracellular receptor 1 Sigma1-receptor Sterol isomerase-like protein
Type:
Protein
Mol. Mass.:
25307.17
Organism:
Cavia porcellus (Guinea pig)
Description:
Q60492
Residue:
223
  
Inhibitor
Name:
BDBM50351977
Synonyms:
CHEMBL1822399
Type:
Small organic molecule
Emp. Form.:
C25H30N2O4
Mol. Mass.:
422.5167
SMILES:
COc1ccc(cc1)C(=O)C1CCN(CC1)[C@H]1CCN(C[C@@H]1O)C(=O)c1ccccc1
: