Target
D(3) dopamine receptor
Ligand
BDBM50352724
Substrate
Meas. Tech.
ChEMBL_766800 (CHEMBL1827740)
IC50
493±n/a nM
Citation
 Seo, HJPark, EJKim, MJKang, SYLee, SHKim, HJLee, KNJung, MELee, MKim, MSSon, EJPark, WKKim, JLee, J Design and synthesis of novel arylpiperazine derivatives containing the imidazole core targeting 5-HT(2A) receptor and 5-HT transporter. J Med Chem 54:6305-18 (2011)  
Target
Name:
D(3) dopamine receptor
Synonyms:
DOPAMINE D3 DRD3_HUMAN Dopamine D3 receptor (D3) Dopamine receptor Dopamine receptor D3
Type:
Mol. Mass.:
44243.43
Organism:
Homo sapiens (Human)
Description:
Residue:
400
  
Inhibitor
Name:
BDBM50352724
Synonyms:
CHEMBL1822896 | US8835436, Example 6
Type:
Small organic molecule
Emp. Form.:
C25H29Cl2N5O
Mol. Mass.:
486.437
SMILES:
Cc1nc(C(=O)NCCCN2CCN(CC2)c2cccc(Cl)c2Cl)c(C)n1-c1ccccc1
: