Target
Plasminogen activator inhibitor 1
Ligand
BDBM50139534
Substrate
Meas. Tech.
ChEMBL_771275 (CHEMBL1839463)
IC50
500±n/a nM
Citation
 Pandya, VJain, MChakrabarti, GSoni, HParmar, BChaugule, BPatel, JJoshi, JJoshi, NRath, ARaviya, MShaikh, MSairam, KVPatel, HPatel, P Discovery of inhibitors of plasminogen activator inhibitor-1: structure-activity study of 5-nitro-2-phenoxybenzoic acid derivatives. Bioorg Med Chem Lett 21:5701-6 (2011)  
Target
Name:
Plasminogen activator inhibitor 1
Synonyms:
Endothelial plasminogen activator inhibitor PAI-1 PAI1_HUMAN Plasminogen activator inhibitor 1 Plasminogen activator inhibitor-1 SERPINE1
Type:
Enzyme
Mol. Mass.:
45064.00
Organism:
Homo sapiens (Human)
Description:
P05121
Residue:
402
  
Inhibitor
Name:
BDBM50139534
Synonyms:
2-[2-Methoxy-6-({3-trifluoromethyl-4-[4-(3-trifluoromethyl-phenyl)-piperazin-1-yl]-phenylamino}-methyl)-phenoxy]-5-nitro-benzoic acid | CHEMBL349130
Type:
Small organic molecule
Emp. Form.:
C33H28F6N4O6
Mol. Mass.:
690.589
SMILES:
COc1cccc(CNc2ccc(N3CCN(CC3)c3cccc(c3)C(F)(F)F)c(c2)C(F)(F)F)c1Oc1ccc(cc1C(O)=O)[N+]([O-])=O
: