Target
Amine oxidase [flavin-containing] B
Ligand
BDBM50300895
Substrate
Meas. Tech.
ChEMBL_772926 (CHEMBL1838814)
IC50
0.8±n/a nM
Citation
 Matos, MJTerán, CPérez-Castillo, YUriarte, ESantana, LViña, D Synthesis and study of a series of 3-arylcoumarins as potent and selective monoamine oxidase B inhibitors. J Med Chem 54:7127-37 (2011)  
Target
Name:
Amine oxidase [flavin-containing] B
Synonyms:
AOFB_HUMAN MAOB Monoamine oxidase type B (MAO B) Monoamine oxidase type B (MAOB)
Type:
Protein
Mol. Mass.:
58768.76
Organism:
Homo sapiens (Human)
Description:
P27338
Residue:
520
  
Inhibitor
Name:
BDBM50300895
Synonyms:
3-(3-methoxyphenyl)-6-methyl-2H-chromen-2-one | CHEMBL570731
Type:
Small organic molecule
Emp. Form.:
C17H14O3
Mol. Mass.:
266.2913
SMILES:
COc1cccc(c1)-c1cc2cc(C)ccc2oc1=O
: