Target
Serine/threonine-protein kinase PRP4 homolog
Ligand
BDBM50026612
Substrate
Meas. Tech.
ChEMBL_774230 (CHEMBL1908447)
Kd
8.4±n/a nM
Citation
 Davis, MIHunt, JPHerrgard, SCiceri, PWodicka, LMPallares, GHocker, MTreiber, DKZarrinkar, PP Comprehensive analysis of kinase inhibitor selectivity. Nat Biotechnol 29:1046-51 (2011)  
Target
Name:
Serine/threonine-protein kinase PRP4 homolog
Synonyms:
KIAA0536 PRP4 kinase PRP4 pre-mRNA-processing factor 4 homolog PRP4H PRPF4B | Serine/threonine-protein kinase PRP4 homolog
Type:
Enzyme
Mol. Mass.:
117103.41
Organism:
Homo sapiens (Human)
Description:
Q13523
Residue:
1007
  
Inhibitor
Name:
BDBM50026612
Synonyms:
BIBF-1120 US10981896, Compound Nintedanib US11208381, Nintedanib | Vargatef
Type:
Small organic molecule
Emp. Form.:
C31H33N5O4
Mol. Mass.:
539.6248
SMILES:
COC(=O)c1ccc2\C(=C(\Nc3ccc(cc3)N(C)C(=O)CN3CCN(C)CC3)c3ccccc3)C(=O)Nc2c1
: