Target
Calcium/calmodulin-dependent protein kinase type 1
Ligand
BDBM31088
Substrate
Meas. Tech.
ChEMBL_774402 (CHEMBL1908619)
Kd
>10000±n/a nM
Citation
 Davis, MIHunt, JPHerrgard, SCiceri, PWodicka, LMPallares, GHocker, MTreiber, DKZarrinkar, PP Comprehensive analysis of kinase inhibitor selectivity. Nat Biotechnol 29:1046-51 (2011)  
Target
Name:
Calcium/calmodulin-dependent protein kinase type 1
Synonyms:
CAMK1 CaM kinase I alpha CaMKI-alpha KCC1A_HUMAN
Type:
PROTEIN
Mol. Mass.:
41325.04
Organism:
Homo sapiens (Human)
Description:
ChEMBL_655701
Residue:
370
  
Inhibitor
Name:
BDBM31088
Synonyms:
1-methyl-5-[2-[5-(trifluoromethyl)-1H-imidazol-2-yl]pyridin-4-yl]oxy-N-[4-(trifluoromethyl)phenyl]benzimidazol-2-amine CHIR-265 cid_11656518
Type:
Small organic molecule
Emp. Form.:
C24H16F6N6O
Mol. Mass.:
518.4139
SMILES:
Cn1c(Nc2ccc(cc2)C(F)(F)F)nc2cc(Oc3ccnc(c3)-c3ncc([nH]3)C(F)(F)F)ccc12
: