Target
Sodium channel protein type 5 subunit alpha
Ligand
BDBM50357207
Substrate
Meas. Tech.
ChEMBL_787993 (CHEMBL1918927)
IC50
>5000±n/a nM
Citation
 Lowes, DJGuiguemde, WAConnelly, MCZhu, FSigal, MSClark, JALemoff, ASDerisi, JLWilson, EBGuy, RK Optimization of propafenone analogues as antimalarial leads. J Med Chem 54:7477-85 (2011)  
Target
Name:
Sodium channel protein type 5 subunit alpha
Synonyms:
HH1 SCN5A_HUMAN Sodium channel protein type 5 subunit alpha/beta-1/beta-2 Voltage-gated sodium channel subunit alpha Nav1.5
Type:
Enzyme
Mol. Mass.:
226908.60
Organism:
Homo sapiens (Human)
Description:
Q14524
Residue:
2016
  
Inhibitor
Name:
BDBM50357207
Synonyms:
CHEMBL1915364 | CHEMBL1963307
Type:
Small organic molecule
Emp. Form.:
C35H37FN2O3
Mol. Mass.:
552.6783
SMILES:
OC(COc1ccc(F)cc1C(=O)CCc1ccccc1)CN1CCN(CC1)C(c1ccccc1)c1ccccc1
: