Target
Histamine H1 receptor
Ligand
BDBM50419460
Substrate
Meas. Tech.
ChEMBL_790127 (CHEMBL1926406)
Ki
1905.46±n/a nM
Citation
 de Graaf, CKooistra, AJVischer, HFKatritch, VKuijer, MShiroishi, MIwata, SShimamura, TStevens, RCde Esch, IJLeurs, R Crystal structure-based virtual screening for fragment-like ligands of the human histamine H(1) receptor. J Med Chem 54:8195-206 (2011)  
Target
Name:
Histamine H1 receptor
Synonyms:
H1R HISTAMINE H1 HRH1_HUMAN
Type:
G Protein-Coupled Receptor (GPCR)
Mol. Mass.:
55808.72
Organism:
Homo sapiens (Human)
Description:
Cell pellets from SK-N-MC cells transfected with human H1 receptor were used in binding assay.
Residue:
487
  
Inhibitor
Name:
BDBM50419460
Synonyms:
CHEMBL1403257
Type:
Small organic molecule
Emp. Form.:
C15H25N7
Mol. Mass.:
303.4059
SMILES:
C1CCN(C1)c1nc(nc(n1)N1CCNCC1)N1CCCC1
: