Target
Serine/threonine-protein kinase WNK2
Ligand
BDBM50359359
Substrate
Meas. Tech.
ChEMBL_793977 (CHEMBL1931569)
IC50
>30000±n/a nM
Citation
 Moffett, KKonteatis, ZNguyen, DShetty, RLudington, JFujimoto, TLee, KJChai, XNamboodiri, HKarpusas, MDorsey, BGuarnieri, FBukhtiyarova, MSpringman, EMichelotti, E Discovery of a novel class of non-ATP site DFG-out state p38 inhibitors utilizing computationally assisted virtual fragment-based drug design (vFBDD). Bioorg Med Chem Lett 21:7155-65 (2011)  
Target
Name:
Serine/threonine-protein kinase WNK2
Synonyms:
KIAA1760 SDCCAG43 WNK2_HUMAN
Type:
Protein
Mol. Mass.:
242660.61
Organism:
Homo sapiens (Human)
Description:
Q9Y3S1
Residue:
2297
  
Inhibitor
Name:
BDBM50359359
Synonyms:
CHEMBL1929238
Type:
Small organic molecule
Emp. Form.:
C25H33Cl2N5O3S
Mol. Mass.:
554.532
SMILES:
CN(C)CCN1CCN(CCC1=O)C(=O)c1cc(sc1NC(=O)Nc1cccc(Cl)c1Cl)C(C)(C)C
: