Target
Ephrin type-A receptor 5
Ligand
BDBM50359359
Substrate
Meas. Tech.
ChEMBL_793873 (CHEMBL1932846)
IC50
>30000±n/a nM
Citation
 Moffett, KKonteatis, ZNguyen, DShetty, RLudington, JFujimoto, TLee, KJChai, XNamboodiri, HKarpusas, MDorsey, BGuarnieri, FBukhtiyarova, MSpringman, EMichelotti, E Discovery of a novel class of non-ATP site DFG-out state p38 inhibitors utilizing computationally assisted virtual fragment-based drug design (vFBDD). Bioorg Med Chem Lett 21:7155-65 (2011)  
Target
Name:
Ephrin type-A receptor 5
Synonyms:
BSK EPHA5 Ephrin receptor HEK7 | TYRO4
Type:
PROTEIN
Mol. Mass.:
114807.59
Organism:
Homo sapiens (Human)
Description:
ChEMBL_774217
Residue:
1037
  
Inhibitor
Name:
BDBM50359359
Synonyms:
CHEMBL1929238
Type:
Small organic molecule
Emp. Form.:
C25H33Cl2N5O3S
Mol. Mass.:
554.532
SMILES:
CN(C)CCN1CCN(CCC1=O)C(=O)c1cc(sc1NC(=O)Nc1cccc(Cl)c1Cl)C(C)(C)C
: