Target
Epidermal growth factor receptor
Ligand
BDBM50359997
Substrate
Meas. Tech.
ChEMBL_791584 (CHEMBL1930721)
IC50
5.93±n/a nM
Citation
 Beckers, TSellmer, AEichhorn, EPongratz, HSchächtele, CTotzke, FKelter, GKrumbach, RFiebig, HHBöhmer, FDMahboobi, S Novel inhibitors of epidermal growth factor receptor: (4-(Arylamino)-7H-pyrrolo[2,3-d]pyrimidin-6-yl)(1H-indol-2-yl)methanones and (1H-indol-2-yl)(4-(phenylamino)thieno[2,3-d]pyrimidin-6-yl)methanones. Bioorg Med Chem 20:125-36 (2011)  
Target
Name:
Epidermal growth factor receptor
Synonyms:
EGF Receptor Substrate EGFR_HUMAN ERBB1 Epidermal Growth Factor Receptor erbB-1 Epidermal growth factor receptor (EGFR) HER1 Proto-oncogene c-ErbB-1 Tyrosine-Protein Kinase ErbB-1
Type:
Receptor Kinase Domain
Mol. Mass.:
134279.59
Organism:
Homo sapiens (Human)
Description:
P00533
Residue:
1210
  
Inhibitor
Name:
BDBM50359997
Synonyms:
CHEMBL1928312
Type:
Small organic molecule
Emp. Form.:
C22H14ClFN4O2S
Mol. Mass.:
452.889
SMILES:
COc1ccc2[nH]c(cc2c1)C(=O)c1cc2c(Nc3ccc(F)c(Cl)c3)ncnc2s1
: