Target
ATP-binding cassette sub-family C member 8
Ligand
BDBM50363003
Substrate
Meas. Tech.
ChEMBL_800636 (CHEMBL1947668)
IC50
1410±n/a nM
Citation
 de Tullio, PServais, ACFillet, MGillotin, FSomers, FChiap, PLebrun, PPirotte, B Hydroxylated analogues of ATP-sensitive potassium channel openers belonging to the group of 6- and/or 7-substituted 3-isopropylamino-4H-1,2,4-benzothiadiazine 1,1-dioxides: toward an improvement in sulfonylurea receptor 1 selectivity and metabolism stability. J Med Chem 54:8353-61 (2011)  
Target
Name:
ATP-binding cassette sub-family C member 8
Synonyms:
ABCC8_RAT Sulfonylurea receptor 1 Sur1
Type:
PROTEIN
Mol. Mass.:
177210.63
Organism:
Rattus norvegicus
Description:
ChEMBL_800636
Residue:
1582
  
Inhibitor
Name:
BDBM50363003
Synonyms:
CHEMBL1946139
Type:
Small organic molecule
Emp. Form.:
C10H11Cl2N3O3S
Mol. Mass.:
324.184
SMILES:
CC(CO)NC1=Nc2cc(Cl)c(Cl)cc2S(=O)(=O)N1
: