Target
Kynurenine--oxoglutarate transaminase 1
Ligand
BDBM50364910
Substrate
Meas. Tech.
ChEMBL_804058 (CHEMBL1952453)
IC50
21000±n/a nM
Citation
 Akladios, FNNadvi, NAPark, JHanrahan, JRKapoor, VGorrell, MDChurch, WB Design and synthesis of novel inhibitors of human kynurenine aminotransferase-I. Bioorg Med Chem Lett 22:1579-81 (2012)  
Target
Name:
Kynurenine--oxoglutarate transaminase 1
Synonyms:
CCBL1 Glutamine--phenylpyruvate transaminase KYAT1 Kynurenine--oxoglutarate transaminase 1
Type:
Aminotransferase; Lyase
Mol. Mass.:
47874.00
Organism:
Homo sapiens (Human)
Description:
Recombinant hKAT-1 was expressed and purified from Sf9 insect cells.
Residue:
422
  
Inhibitor
Name:
BDBM50364910
Synonyms:
CHEMBL1950174
Type:
Small organic molecule
Emp. Form.:
C14H17BrN2O4
Mol. Mass.:
357.2
SMILES:
CCOC(=O)C(CCCC(O)=O)=NNc1ccc(Br)cc1
: