Target
Cytochrome P450 2C9
Ligand
BDBM50365043
Substrate
Meas. Tech.
ChEMBL_804724 (CHEMBL1953351)
IC50
>30000±n/a nM
Citation
 Sundar, BGBailey, TRDunn, DHostetler, GAChatterjee, SBacon, ERYue, CSchweizer, DAimone, LDGruner, JALyons, JRaddatz, RLesur, B Novel morpholine ketone analogs as potent histamine H3 receptor inverse agonists with wake activity. Bioorg Med Chem Lett 22:1546-9 (2012)  
Target
Name:
Cytochrome P450 2C9
Synonyms:
(R)-limonene 6-monooxygenase CP2C9_HUMAN CYP2C9 Cytochrome P450 2C9 (CYP2C9 ) P-450MP P450 PB-1 | S-mephenytoin 4-hydroxylase
Type:
Enzyme
Mol. Mass.:
55636.33
Organism:
Homo sapiens (Human)
Description:
P11712
Residue:
490
  
Inhibitor
Name:
BDBM50365043
Synonyms:
CHEMBL1951055
Type:
Small organic molecule
Emp. Form.:
C20H30N2O3
Mol. Mass.:
346.4638
SMILES:
C[C@@H]1CCCN1CCCOc1ccc(cc1)C(=O)CN1CCOCC1
: