Target
Histamine H3 receptor
Ligand
BDBM50365053
Substrate
Meas. Tech.
ChEMBL_804715 (CHEMBL1953342)
Ki
10±n/a nM
Citation
 Sundar, BGBailey, TRDunn, DHostetler, GAChatterjee, SBacon, ERYue, CSchweizer, DAimone, LDGruner, JALyons, JRaddatz, RLesur, B Novel morpholine ketone analogs as potent histamine H3 receptor inverse agonists with wake activity. Bioorg Med Chem Lett 22:1546-9 (2012)  
Target
Name:
Histamine H3 receptor
Synonyms:
G-protein coupled receptor 97 HH3R HRH3 Histamine H3 receptor (H3) Histamine receptor (H3 and H4)
Type:
G Protein-Coupled Receptor (GPCR)
Mol. Mass.:
48691.47
Organism:
Homo sapiens (Human)
Description:
Binding assays were using CHO cells stably expressing hH3R receptors.
Residue:
445
  
Inhibitor
Name:
BDBM50365053
Synonyms:
CHEMBL1951062
Type:
Small organic molecule
Emp. Form.:
C22H34N2O3
Mol. Mass.:
374.517
SMILES:
C[C@@H]1CCCN1CCCOc1ccc(cc1)C(=O)CN1C[C@H](C)O[C@H](C)C1
: