Target
Histamine H3 receptor
Ligand
BDBM50365046
Substrate
Meas. Tech.
ChEMBL_804714 (CHEMBL1953341)
Ki
440±n/a nM
Citation
 Sundar, BGBailey, TRDunn, DHostetler, GAChatterjee, SBacon, ERYue, CSchweizer, DAimone, LDGruner, JALyons, JRaddatz, RLesur, B Novel morpholine ketone analogs as potent histamine H3 receptor inverse agonists with wake activity. Bioorg Med Chem Lett 22:1546-9 (2012)  
Target
Name:
Histamine H3 receptor
Synonyms:
HH3R Hrh3
Type:
G Protein-Coupled Receptor (GPCR)
Mol. Mass.:
48607.98
Organism:
Rattus norvegicus (rat)
Description:
Residue:
445
  
Inhibitor
Name:
BDBM50365046
Synonyms:
CHEMBL1951054
Type:
Small organic molecule
Emp. Form.:
C20H30N2O3
Mol. Mass.:
346.4638
SMILES:
O=C(CN1CCOCC1)c1ccc(OCCCN2CCCCC2)cc1
: