Target
Histamine H3 receptor
Ligand
BDBM50365054
Substrate
Meas. Tech.
ChEMBL_804714 (CHEMBL1953341)
Ki
244±n/a nM
Citation
 Sundar, BGBailey, TRDunn, DHostetler, GAChatterjee, SBacon, ERYue, CSchweizer, DAimone, LDGruner, JALyons, JRaddatz, RLesur, B Novel morpholine ketone analogs as potent histamine H3 receptor inverse agonists with wake activity. Bioorg Med Chem Lett 22:1546-9 (2012)  
Target
Name:
Histamine H3 receptor
Synonyms:
HH3R Hrh3
Type:
G Protein-Coupled Receptor (GPCR)
Mol. Mass.:
48607.98
Organism:
Rattus norvegicus (rat)
Description:
Residue:
445
  
Inhibitor
Name:
BDBM50365054
Synonyms:
CHEMBL1951063
Type:
Small organic molecule
Emp. Form.:
C21H32N2O3
Mol. Mass.:
360.4904
SMILES:
C[C@@H]1CCCN1CCCOc1ccc(C(=O)CN2CCOCC2)c(C)c1
: