Target
Macrophage colony-stimulating factor 1 receptor
Ligand
BDBM32362
Substrate
Meas. Tech.
ChEMBL_806394 (CHEMBL1959323)
IC50
30±n/a nM
Citation
 Conway, JGMcDonald, BParham, JKeith, BRusnak, DWShaw, EJansen, MLin, PPayne, ACrosby, RMJohnson, JHFrick, LLin, MHDepee, STadepalli, SVotta, BJames, IFuller, KChambers, TJKull, FCChamberlain, SDHutchins, JT Inhibition of colony-stimulating-factor-1 signaling in vivo with the orally bioavailable cFMS kinase inhibitor GW2580. Proc Natl Acad Sci U S A 102:16078-83 (2005)  
Target
Name:
Macrophage colony-stimulating factor 1 receptor
Synonyms:
CSF1R FMS Macrophage colony stimulating factor receptor Macrophage colony-stimulating factor 1 receptor (c-FMS) Proto-oncogene c-Fms c-fms | cFMS
Type:
Protein
Mol. Mass.:
107979.48
Organism:
Homo sapiens (Human)
Description:
P07333
Residue:
972
  
Inhibitor
Name:
BDBM32362
Synonyms:
5-[[3-methoxy-4-[(4-methoxyphenyl)methoxy]phenyl]methyl]pyrimidine-2,4-diamine [2-amino-5-(3-methoxy-4-p-anisyloxy-benzyl)pyrimidin-4-yl]amine | cid_11617559
Type:
Small organic molecule
Emp. Form.:
C20H22N4O3
Mol. Mass.:
366.4137
SMILES:
COc1ccc(COc2ccc(Cc3cnc(N)nc3N)cc2OC)cc1
: