Target
Platelet-activating factor receptor
Ligand
BDBM50282027
Substrate
Meas. Tech.
ChEBML_155136
IC50
150±n/a nM
Citation
 Whittaker, MThompson, TMSpavold, ZMPrice, MMiller, AGalloway, WFraser, FFloyd, CDDrummond, AHDavidson, AHBowles, SABebbington, DS Cyclic ether acetal platelet activating factor (PAF) receptor antagonists I: 3-pyridyl derivatives Bioorg Med Chem Lett 3:1493-1498 (1993)    Article 
Target
Name:
Platelet-activating factor receptor
Synonyms:
PAF Platelet activating factor PAFR PTAFR_HUMAN Platelet-activating factor receptor
Type:
Enzyme Catalytic Domain
Mol. Mass.:
39219.60
Organism:
Homo sapiens (Human)
Description:
PAF Platelet activating factor PTAFR HUMAN::P25105
Residue:
342
  
Inhibitor
Name:
BDBM50282027
Synonyms:
3-{3-[(2S,5R)-5-(3,4-Dimethoxy-phenyl)-tetrahydro-furan-2-yloxy]-propyl}-pyridine | CHEMBL37951
Type:
Small organic molecule
Emp. Form.:
C20H25NO4
Mol. Mass.:
343.4168
SMILES:
COc1ccc(cc1OC)[C@H]1CC[C@@H](OCCCc2cccnc2)O1
: