Target
Endothelin-1 receptor
Ligand
BDBM50290042
Substrate
Meas. Tech.
ChEBML_65500
IC50
7±n/a nM
Citation
 Neidhart, WBreu, VBurri, KClozel, MHirth, GKlinkhammer, UGiller, TRamuz, H Discovery of Ro 48-5695: A potent mixed endothelin receptor antagonist optimized from bosentan Bioorg Med Chem Lett 7:2223-2228 (1997)    Article 
Target
Name:
Endothelin-1 receptor
Synonyms:
EDNRA ET-A ETA-R Endothelin receptor type A hET-AR
Type:
Enzyme Catalytic Domain
Mol. Mass.:
48736.88
Organism:
Homo sapiens (Human)
Description:
P25101
Residue:
427
  
Inhibitor
Name:
BDBM50290042
Synonyms:
CHEMBL70487 | Pyridin-2-yl-carbamic acid 2-[6-(4-tert-butyl-benzenesulfonylamino)-2-cyclopropyl-5-(2-methoxy-phenoxy)-pyrimidin-4-yloxy]-ethyl ester
Type:
Small organic molecule
Emp. Form.:
C32H35N5O7S
Mol. Mass.:
633.715
SMILES:
COc1ccccc1Oc1c(NS(=O)(=O)c2ccc(cc2)C(C)(C)C)nc(nc1OCCOC(=O)Nc1ccccn1)C1CC1
: