Target
Plasmepsin II
Ligand
BDBM50071562
Substrate
Meas. Tech.
ChEBML_154921
Ki
560±n/a nM
Citation
 Carroll, CDPatel, HJohnson, TOGuo, TOrlowski, MHe, ZMCavallaro, CLGuo, JOksman, AGluzman, IYConnelly, JChelsky, DGoldberg, DEDolle, RE Identification of potent inhibitors of Plasmodium falciparum plasmepsin II from an encoded statine combinatorial library. Bioorg Med Chem Lett 8:2315-20 (1999)  
Target
Name:
Plasmepsin II
Synonyms:
Aspartic hemoglobinase II PLM2_PLAFX Plasmepsin 2 Plasmepsin-II
Type:
Enzyme
Mol. Mass.:
51482.09
Organism:
Plasmodium falciparum
Description:
P46925
Residue:
453
  
Inhibitor
Name:
BDBM50071562
Synonyms:
3-Hydroxy-4-{(S)-2-[2-(naphthalen-2-yloxy)-acetylamino]-2-phenyl-acetylamino}-5-phenyl-pentanoic acid butylamide | CHEMBL308036
Type:
Small organic molecule
Emp. Form.:
C35H39N3O5
Mol. Mass.:
581.7013
SMILES:
CCCCNC(=O)CC(O)C(Cc1ccccc1)NC(=O)[C@@H](NC(=O)COc1ccc2ccccc2c1)c1ccccc1
: