Target
Plasmepsin II
Ligand
BDBM50071559
Substrate
Meas. Tech.
ChEBML_154921
Ki
>30000±n/a nM
Citation
 Carroll, CDPatel, HJohnson, TOGuo, TOrlowski, MHe, ZMCavallaro, CLGuo, JOksman, AGluzman, IYConnelly, JChelsky, DGoldberg, DEDolle, RE Identification of potent inhibitors of Plasmodium falciparum plasmepsin II from an encoded statine combinatorial library. Bioorg Med Chem Lett 8:2315-20 (1999)  
Target
Name:
Plasmepsin II
Synonyms:
Aspartic hemoglobinase II PLM2_PLAFX Plasmepsin 2 Plasmepsin-II
Type:
Enzyme
Mol. Mass.:
51482.09
Organism:
Plasmodium falciparum
Description:
P46925
Residue:
453
  
Inhibitor
Name:
BDBM50071559
Synonyms:
(S)-2-[2-(Naphthalen-2-yloxy)-acetylamino]-pentanedioic acid 5-amide 1-[(1-benzyl-3-butylcarbamoyl-2-hydroxy-propyl)-amide] | CHEMBL73919
Type:
Small organic molecule
Emp. Form.:
C32H40N4O6
Mol. Mass.:
576.6832
SMILES:
CCCCNC(=O)CC(O)C(Cc1ccccc1)NC(=O)[C@H](CCC(N)=O)NC(=O)COc1ccc2ccccc2c1
: