Target
Adenosine receptor A1
Ligand
BDBM50004714
Substrate
Meas. Tech.
ChEBML_29467
Ki
9400±n/a nM
Citation
 Camp, DLi, YMcCluskey, AMoni, RWQuinn, RJ Diimidazo[1,2-c:4',5'-e]pyrimidines: N6-N1 conformationally restricted adenosines. Bioorg Med Chem Lett 8:695-8 (1999)  
Target
Name:
Adenosine receptor A1
Synonyms:
AA1R_RAT ADENOSINE A1 high Adenosine A1 receptor (A1) Adenosine receptors A1 | Adora1
Type:
Protein
Mol. Mass.:
36704.13
Organism:
Rattus norvegicus (rat)
Description:
Residue:
326
  
Inhibitor
Name:
BDBM50004714
Synonyms:
(S)-2-Benzyl-7-phenyl-5-propoxy-2,7-dihydro-3H-imidazo[1,2-c]pyrazolo[4,3-e]pyrimidine CHEMBL110426
Type:
Small organic molecule
Emp. Form.:
C23H23N5O
Mol. Mass.:
385.4616
SMILES:
CCCOC1=Nc2c(cnn2-c2ccccc2)C2=N[C@@H](Cc3ccccc3)CN12
: