Target
Prothrombin
Ligand
BDBM50076945
Substrate
Meas. Tech.
ChEMBL_208867 (CHEMBL808333)
IC50
120±n/a nM
Citation
 Adang, AEPeters, AMGerritsma, Sde Zwart, EVeeneman, G Solution-phase and solid-phase synthesis of novel transition state inhibitors of coagulation enzymes incorporating a piperidinyl moiety. Bioorg Med Chem Lett 9:1227-32 (1999)  
Target
Name:
Prothrombin
Synonyms:
Activation peptide fragment 1 Coagulation factor II Prothrombin precursor Thrombin heavy chain | Thrombin light chain
Type:
Protein
Mol. Mass.:
70029.57
Organism:
Homo sapiens (Human)
Description:
P00734
Residue:
622
  
Inhibitor
Name:
BDBM50076945
Synonyms:
(S)-1-((R)-3-Cyclohexyl-2-ethanesulfonylamino-propionyl)-pyrrolidine-2-carboxylic acid ((S)-2-oxo-1-piperidin-4-ylmethyl-2-thiazol-2-yl-ethyl)-amide CHEMBL22100
Type:
Small organic molecule
Emp. Form.:
C27H43N5O5S2
Mol. Mass.:
581.791
SMILES:
CCS(=O)(=O)N[C@H](CC1CCCCC1)C(=O)N1CCC[C@H]1C(=O)N[C@@H](CC1CCNCC1)C(=O)c1nccs1
: