Target
Beta-3 adrenergic receptor
Ligand
BDBM50106807
Substrate
Meas. Tech.
ChEBML_39052
Ki
70±n/a nM
Citation
Target
Name:
Beta-3 adrenergic receptor
Synonyms:
ADRB3 ADRB3_HUMAN Beta-2 adrenergic receptor and beta-3 adrenergic receptor Beta-3 adrenoreceptor | adrenergic Beta3
Type:
G Protein-Coupled Receptor (GPCR)
Mol. Mass.:
43534.88
Organism:
Homo sapiens (Human)
Description:
Residue:
408
  
Inhibitor
Name:
BDBM50106807
Synonyms:
CHEMBL103147 | N-(5-{2-[1-(2,4-Dimethoxy-phenyl)-2-phenyl-ethylamino]-1-hydroxy-ethyl}-2-hydroxy-phenyl)-methanesulfonamide
Type:
Small organic molecule
Emp. Form.:
C25H30N2O6S
Mol. Mass.:
486.581
SMILES:
COc1ccc(C(Cc2ccccc2)NCC(O)c2ccc(O)c(NS(C)(=O)=O)c2)c(OC)c1
: