Target
Sodium-dependent dopamine transporter
Ligand
BDBM50099313
Substrate
Meas. Tech.
ChEMBL_216233 (CHEMBL823866)
IC50
494±n/a nM
Citation
 Enyedy, IJZaman, WASakamuri, SKozikowski, APJohnson, KMWang, S Pharmacophore-based discovery of 3,4-disubstituted pyrrolidines as a novel class of monoamine transporter inhibitors. Bioorg Med Chem Lett 11:1113-8 (2001)  
Target
Name:
Sodium-dependent dopamine transporter
Synonyms:
DA transporter SC6A3_RAT Sodium-dependent dopamine transporter | Sodium-dependent dopamine transporter (DAT)
Type:
Multi-pass membrane protein
Mol. Mass.:
68749.45
Organism:
Rattus norvegicus (rat)
Description:
P23977
Residue:
619
  
Inhibitor
Name:
BDBM50099313
Synonyms:
((3S,4R)-1-Methyl-4-phenyl-pyrrolidin-3-yl)-pyridin-2-yl-methanone | CHEMBL275060
Type:
Small organic molecule
Emp. Form.:
C17H18N2O
Mol. Mass.:
266.3376
SMILES:
CN1C[C@H]([C@@H](C1)c1ccccc1)C(=O)c1ccccn1
: