Target
Sodium-dependent dopamine transporter
Ligand
BDBM50099311
Substrate
Meas. Tech.
ChEMBL_62632 (CHEMBL676678)
Ki
3170±n/a nM
Citation
 Enyedy, IJZaman, WASakamuri, SKozikowski, APJohnson, KMWang, S Pharmacophore-based discovery of 3,4-disubstituted pyrrolidines as a novel class of monoamine transporter inhibitors. Bioorg Med Chem Lett 11:1113-8 (2001)  
Target
Name:
Sodium-dependent dopamine transporter
Synonyms:
DA transporter SC6A3_RAT Sodium-dependent dopamine transporter | Sodium-dependent dopamine transporter (DAT)
Type:
Multi-pass membrane protein
Mol. Mass.:
68749.45
Organism:
Rattus norvegicus (rat)
Description:
P23977
Residue:
619
  
Inhibitor
Name:
BDBM50099311
Synonyms:
CHEMBL441219 | [(3S,4R)-4-(4-Chloro-phenyl)-1-methyl-pyrrolidin-3-yl]-(3-trifluoromethyl-phenyl)-methanone
Type:
Small organic molecule
Emp. Form.:
C19H17ClF3NO
Mol. Mass.:
367.793
SMILES:
CN1C[C@H]([C@@H](C1)c1ccc(Cl)cc1)C(=O)c1cccc(c1)C(F)(F)F
: