Target
Sodium-dependent dopamine transporter
Ligand
BDBM50099312
Substrate
Meas. Tech.
ChEMBL_62632 (CHEMBL676678)
Ki
1220±n/a nM
Citation
 Enyedy, IJZaman, WASakamuri, SKozikowski, APJohnson, KMWang, S Pharmacophore-based discovery of 3,4-disubstituted pyrrolidines as a novel class of monoamine transporter inhibitors. Bioorg Med Chem Lett 11:1113-8 (2001)  
Target
Name:
Sodium-dependent dopamine transporter
Synonyms:
DA transporter SC6A3_RAT Sodium-dependent dopamine transporter | Sodium-dependent dopamine transporter (DAT)
Type:
Multi-pass membrane protein
Mol. Mass.:
68749.45
Organism:
Rattus norvegicus (rat)
Description:
P23977
Residue:
619
  
Inhibitor
Name:
BDBM50099312
Synonyms:
(4-Chloro-phenyl)-((3S,4R)-1-methyl-4-phenyl-pyrrolidin-3-yl)-methanone | CHEMBL268999
Type:
Small organic molecule
Emp. Form.:
C18H18ClNO
Mol. Mass.:
299.795
SMILES:
CN1C[C@H]([C@@H](C1)c1ccccc1)C(=O)c1ccc(Cl)cc1
: