Target
Transporter
Ligand
BDBM50099305
Substrate
Meas. Tech.
ChEBML_143123
Ki
69±n/a nM
Citation
 Enyedy, IJZaman, WASakamuri, SKozikowski, APJohnson, KMWang, S Pharmacophore-based discovery of 3,4-disubstituted pyrrolidines as a novel class of monoamine transporter inhibitors. Bioorg Med Chem Lett 11:1113-8 (2001)  
Target
Name:
Transporter
Synonyms:
Monoamine transporters; Norepininephrine & dopamine | Norepinephrine Monoamine transporters
Type:
PROTEIN
Mol. Mass.:
66787.87
Organism:
Rattus norvegicus
Description:
ChEMBL_1463061
Residue:
597
  
Inhibitor
Name:
BDBM50099305
Synonyms:
(2-Chloro-phenyl)-[(3S,4R)-4-(4-chloro-phenyl)-1-methyl-pyrrolidin-3-yl]-methanone | CHEMBL269445
Type:
Small organic molecule
Emp. Form.:
C18H17Cl2NO
Mol. Mass.:
334.24
SMILES:
CN1C[C@H]([C@@H](C1)c1ccc(Cl)cc1)C(=O)c1ccccc1Cl
: