Target
Sodium-dependent serotonin transporter
Ligand
BDBM50099313
Substrate
Meas. Tech.
ChEBML_202129
Ki
830±n/a nM
Citation
 Enyedy, IJZaman, WASakamuri, SKozikowski, APJohnson, KMWang, S Pharmacophore-based discovery of 3,4-disubstituted pyrrolidines as a novel class of monoamine transporter inhibitors. Bioorg Med Chem Lett 11:1113-8 (2001)  
Target
Name:
Sodium-dependent serotonin transporter
Synonyms:
5-HT Transporter 5HT transporter Anandamid membrane transporter, AMT Monoamine transporters; Norepinephrine & serotonin Slc6a4 Sodium-dependent serotonin transporter (SERT) | imipramine receptor
Type:
Multi-pass membrane protein
Mol. Mass.:
70168.43
Organism:
Rattus norvegicus (rat)
Description:
P31652
Residue:
630
  
Inhibitor
Name:
BDBM50099313
Synonyms:
((3S,4R)-1-Methyl-4-phenyl-pyrrolidin-3-yl)-pyridin-2-yl-methanone | CHEMBL275060
Type:
Small organic molecule
Emp. Form.:
C17H18N2O
Mol. Mass.:
266.3376
SMILES:
CN1C[C@H]([C@@H](C1)c1ccccc1)C(=O)c1ccccn1
: