Target
Sodium-dependent dopamine transporter
Ligand
BDBM50099318
Substrate
Meas. Tech.
ChEMBL_62632 (CHEMBL676678)
Ki
>10000±n/a nM
Citation
 Enyedy, IJZaman, WASakamuri, SKozikowski, APJohnson, KMWang, S Pharmacophore-based discovery of 3,4-disubstituted pyrrolidines as a novel class of monoamine transporter inhibitors. Bioorg Med Chem Lett 11:1113-8 (2001)  
Target
Name:
Sodium-dependent dopamine transporter
Synonyms:
DA transporter SC6A3_RAT Sodium-dependent dopamine transporter | Sodium-dependent dopamine transporter (DAT)
Type:
Multi-pass membrane protein
Mol. Mass.:
68749.45
Organism:
Rattus norvegicus (rat)
Description:
P23977
Residue:
619
  
Inhibitor
Name:
BDBM50099318
Synonyms:
CHEMBL13508 | [(3S,4R)-4-(4-Chloro-phenyl)-1-phenyl-pyrrolidin-3-yl]-(2-methoxy-phenyl)-methanone
Type:
Small organic molecule
Emp. Form.:
C24H22ClNO2
Mol. Mass.:
391.89
SMILES:
COc1ccccc1C(=O)[C@@H]1CN(C[C@H]1c1ccc(Cl)cc1)c1ccccc1
: