Target
Melanocortin receptor 4
Ligand
BDBM50121888
Substrate
Meas. Tech.
ChEMBL_106808 (CHEMBL717496)
IC50
150±n/a nM
Citation
 Cheung, AWDanho, WSwistok, JQi, LKurylko, GRowan, KYeon, MFranco, LChu, XJChen, LYagaloff, K Structure-activity relationship of linear peptide Bu-His-DPhe-Arg-Trp-Gly-NH(2) at the human melanocortin-1 and -4 receptors: histidine substitution. Bioorg Med Chem Lett 13:133-7 (2002)  
Target
Name:
Melanocortin receptor 4
Synonyms:
MC4-R MC4R_HUMAN Melanocortin receptor 4 (MC-4) Melanocortin receptor 4 (MC4R)
Type:
Enzyme
Mol. Mass.:
36949.50
Organism:
Homo sapiens (Human)
Description:
P32245
Residue:
332
  
Inhibitor
Name:
BDBM50121888
Synonyms:
5-Dimethylamino-2-pentanoylamino-1,2,3,4-tetrahydro-naphthalene-2-carboxylic acid ((S)-1-{(S)-1-[(S)-1-(carbamoylmethyl-carbamoyl)-2-(1H-indol-3-yl)-ethylcarbamoyl]-4-guanidino-butylcarbamoyl}-2-phenyl-ethyl)-amide | CHEMBL29317
Type:
Small organic molecule
Emp. Form.:
C46H61N11O6
Mol. Mass.:
864.0466
SMILES:
CCCCC(=O)NC1(CCc2c(C1)cccc2N(C)C)C(=O)N[C@H](Cc1ccccc1)C(=O)N[C@@H](CCCNC(N)=N)C(=O)N[C@@H](Cc1c[nH]c2ccccc12)C(=O)NCC(N)=O
: