Target
Melanocyte-stimulating hormone receptor
Ligand
BDBM50121889
Substrate
Meas. Tech.
ChEBML_106680
EC50
680±n/a nM
Citation
 Cheung, AWDanho, WSwistok, JQi, LKurylko, GRowan, KYeon, MFranco, LChu, XJChen, LYagaloff, K Structure-activity relationship of linear peptide Bu-His-DPhe-Arg-Trp-Gly-NH(2) at the human melanocortin-1 and -4 receptors: histidine substitution. Bioorg Med Chem Lett 13:133-7 (2002)  
Target
Name:
Melanocyte-stimulating hormone receptor
Synonyms:
MC1-R MSH-R MSHR_HUMAN Melanocortin receptor (M1 and M4) Melanocortin receptor 1 (MC1-R) | Melanocortin receptor 1 (MC1R)
Type:
Enzyme
Mol. Mass.:
34717.23
Organism:
Homo sapiens (Human)
Description:
Q01726
Residue:
317
  
Inhibitor
Name:
BDBM50121889
Synonyms:
5-Isopropoxy-2-pentanoylamino-1,2,3,4-tetrahydro-naphthalene-2-carboxylic acid ((S)-1-{(S)-1-[(S)-1-(carbamoylmethyl-carbamoyl)-2-(1H-indol-3-yl)-ethylcarbamoyl]-4-guanidino-butylcarbamoyl}-2-phenyl-ethyl)-amide | CHEMBL281060
Type:
Small organic molecule
Emp. Form.:
C47H62N10O7
Mol. Mass.:
879.058
SMILES:
CCCCC(=O)NC1(CCc2c(C1)cccc2OC(C)C)C(=O)N[C@H](Cc1ccccc1)C(=O)N[C@@H](CCCNC(N)=N)C(=O)N[C@@H](Cc1c[nH]c2ccccc12)C(=O)NCC(N)=O
: