Target
Melanocyte-stimulating hormone receptor
Ligand
BDBM50121891
Substrate
Meas. Tech.
ChEBML_106680
EC50
230±n/a nM
Citation
 Cheung, AWDanho, WSwistok, JQi, LKurylko, GRowan, KYeon, MFranco, LChu, XJChen, LYagaloff, K Structure-activity relationship of linear peptide Bu-His-DPhe-Arg-Trp-Gly-NH(2) at the human melanocortin-1 and -4 receptors: histidine substitution. Bioorg Med Chem Lett 13:133-7 (2002)  
Target
Name:
Melanocyte-stimulating hormone receptor
Synonyms:
MC1-R MSH-R MSHR_HUMAN Melanocortin receptor (M1 and M4) Melanocortin receptor 1 (MC1-R) | Melanocortin receptor 1 (MC1R)
Type:
Enzyme
Mol. Mass.:
34717.23
Organism:
Homo sapiens (Human)
Description:
Q01726
Residue:
317
  
Inhibitor
Name:
BDBM50121891
Synonyms:
(S)-2-[(S)-2-((S)-2-Butyrylamino-propionylamino)-3-phenyl-propionylamino]-5-guanidino-pentanoic acid [(S)-1-(carbamoylmethyl-carbamoyl)-2-(1H-indol-3-yl)-ethyl]-amide | CHEMBL29056
Type:
Small organic molecule
Emp. Form.:
C35H48N10O6
Mol. Mass.:
704.819
SMILES:
CCCC(=O)N[C@@H](C)C(=O)N[C@H](Cc1ccccc1)C(=O)N[C@@H](CCCNC(N)=N)C(=O)N[C@@H](Cc1c[nH]c2ccccc12)C(=O)NCC(N)=O
: