Target
Glucocorticoid receptor
Ligand
BDBM18627
Substrate
Meas. Tech.
ChEMBL_71247 (CHEMBL683493)
IC50
1.1±n/a nM
Citation
 Sorensen, BKLink, JTvon Geldern, TEmery, MWang, JHickman, BGrynfarb, MGoos-Nilsson, ACarroll, S An evaluation of a C-glucuronide as a liver targeting group: conjugate of a glucocorticoid antagonist. Bioorg Med Chem Lett 13:2307-10 (2003)  
Target
Name:
Glucocorticoid receptor
Synonyms:
GCR_HUMAN GRL Glucocorticoid receptor (GRFP) Nuclear receptor subfamily 3 group C member 1
Type:
Enzyme
Mol. Mass.:
85656.87
Organism:
Homo sapiens (Human)
Description:
P04150
Residue:
777
  
Inhibitor
Name:
BDBM18627
Synonyms:
(10S,11S,14S,15S,17R)-17-[4-(dimethylamino)phenyl]-14-hydroxy-15-methyl-14-(prop-1-yn-1-yl)tetracyclo[8.7.0.0^{2,7}.0^{11,15}]heptadeca-1,6-dien-5-one Mifepristone RU486 (tetramethyl-rhodamine conjugated)
Type:
Small organic molecule
Emp. Form.:
C29H35NO2
Mol. Mass.:
429.5937
SMILES:
[H][C@@]12CC[C@@](O)(C#CC)[C@@]1(C)C[C@@H](C1=C3CCC(=O)C=C3CC[C@@]21[H])c1ccc(cc1)N(C)C
: