Target
P2X purinoceptor 7
Ligand
BDBM50135425
Substrate
Meas. Tech.
ChEMBL_147427 (CHEMBL754460)
IC50
1±n/a nM
Citation
 Baxter, ABent, JBowers, KBraddock, MBrough, SFagura, MLawson, MMcInally, TMortimore, MRobertson, MWeaver, RWebborn, P Hit-to-Lead studies: the discovery of potent adamantane amide P2X7 receptor antagonists. Bioorg Med Chem Lett 13:4047-50 (2003)  
Target
Name:
P2X purinoceptor 7
Synonyms:
ATP receptor P2RX7_HUMAN P2X purinoceptor 7 (P2X7) P2Z receptor | Purinergic receptor
Type:
Protein
Mol. Mass.:
68602.85
Organism:
Homo sapiens (Human)
Description:
Q99572
Residue:
595
  
Inhibitor
Name:
BDBM50135425
Synonyms:
4-{2-(Isoquinoline-5-sulfonylamino)-3-[4-(isoquinoline-5-sulfonyloxy)-phenyl]-propionyl}-piperazine-1-carboxylic acid tert-butyl ester | CHEMBL338578
Type:
Small organic molecule
Emp. Form.:
C36H37N5O8S2
Mol. Mass.:
731.838
SMILES:
CC(C)(C)OC(=O)N1CCN(CC1)C(=O)C(Cc1ccc(OS(=O)(=O)c2cccc3cnccc23)cc1)NS(=O)(=O)c1cccc2cnccc12
: