Target
Adenylate kinase 2, mitochondrial
Ligand
BDBM50367068
Substrate
Meas. Tech.
ChEBML_32046
Ki
300000±n/a nM
Citation
 Hampton, APicker, DNealy, KAMaeda, M Use of adenine nucleotide derivatives to assess the potential of exo-active-site-directed reagents as species- or isozyme-specific enzyme inactivators. 4. Interactions of adenosine 5'-triphosphate derivatives with adenylate kinases from Escherichia coli and rat tissues. J Med Chem 25:382-6 (1982)  
Target
Name:
Adenylate kinase 2, mitochondrial
Synonyms:
2.7.4.3 ATP-AMP transphosphorylase 2 Adenylate kinase 2 Adenylate monophosphate kinase KAD2_RAT
Type:
Mol. Mass.:
26380.21
Organism:
Rattus norvegicus
Description:
Residue:
239
  
Inhibitor
Name:
BDBM50367068
Synonyms:
CHEMBL3350524 | CHEMBL609795
Type:
Small organic molecule
Emp. Form.:
C18H31IN7O14P3
Mol. Mass.:
789.303
SMILES:
Nc1ncnc2n([C@@H]3O[C@H](COP(O)(=O)OP(O)(=O)OP(O)(O)=O)[C@@H](O)[C@H]3O)c(NCCCCCCNC(=O)CI)nc12
: