Target
Renin
Ligand
BDBM912
Substrate
Meas. Tech.
ChEMBL_196268 (CHEMBL883369)
Ki
13000±n/a nM
Citation
 Boger, JPayne, LSPerlow, DSLohr, NSPoe, MBlaine, EHUlm, EHSchorn, TWLaMont, BILin, TY Renin inhibitors. Syntheses of subnanomolar, competitive, transition-state analogue inhibitors containing a novel analogue of statine. J Med Chem 28:1779-90 (1986)  
Target
Name:
Renin
Synonyms:
Angiotensinogenase RENI_HUMAN
Type:
Enzyme
Mol. Mass.:
45058.99
Organism:
Homo sapiens (Human)
Description:
Residue:
406
  
Inhibitor
Name:
BDBM912
Synonyms:
(3S,4S)-3-hydroxy-4-[(2S)-2-[(3S,4S)-3-hydroxy-6-methyl-4-[(2S)-3-methyl-2-[(2S)-3-methyl-2-(3-methylbutanamido)butanamido]butanamido]heptanamido]propanamido]-6-methylheptanoic acid Iva-Val-Val-Sta-Ala-Sta-OH PEPSTATIN US9115083, Pepstatin
Type:
Small organic molecule
Emp. Form.:
C34H63N5O9
Mol. Mass.:
685.8921
SMILES:
CC(C)C[C@H](NC(=O)[C@H](C)NC(=O)C[C@H](O)[C@H](CC(C)C)NC(=O)[C@@H](NC(=O)[C@@H](NC(=O)CC(C)C)C(C)C)C(C)C)[C@@H](O)CC(O)=O
: