Target
Renin
Ligand
BDBM50025943
Substrate
Meas. Tech.
ChEMBL_196268 (CHEMBL883369)
Ki
4100±n/a nM
Citation
 Boger, JPayne, LSPerlow, DSLohr, NSPoe, MBlaine, EHUlm, EHSchorn, TWLaMont, BILin, TY Renin inhibitors. Syntheses of subnanomolar, competitive, transition-state analogue inhibitors containing a novel analogue of statine. J Med Chem 28:1779-90 (1986)  
Target
Name:
Renin
Synonyms:
Angiotensinogenase RENI_HUMAN
Type:
Enzyme
Mol. Mass.:
45058.99
Organism:
Homo sapiens (Human)
Description:
Residue:
406
  
Inhibitor
Name:
BDBM50025943
Synonyms:
3-Hydroxy-4-[3-(1H-imidazol-4-yl)-2-(2-phenoxy-acetylamino)-propionylamino]-6-methyl-heptanoic acid [1-(1-carbamoyl-2-phenyl-ethylcarbamoyl)-3-methyl-butyl]-amide | CHEMBL3144411
Type:
Small organic molecule
Emp. Form.:
C37H51N7O7
Mol. Mass.:
705.8435
SMILES:
CC(C)C[C@H](NC(=O)[C@H](Cc1c[nH]cn1)NC(=O)COc1ccccc1)[C@@H](O)CC(=O)N[C@@H](CC(C)C)C(=O)N[C@@H](Cc1ccccc1)C(N)=O
: