Target
Renin
Ligand
BDBM50405191
Substrate
Meas. Tech.
ChEBML_193377
pH
7.4±n/a
Ki
630±n/a nM
Comments
extracted
Citation
 Boger, JPayne, LSPerlow, DSLohr, NSPoe, MBlaine, EHUlm, EHSchorn, TWLaMont, BILin, TY Renin inhibitors. Syntheses of subnanomolar, competitive, transition-state analogue inhibitors containing a novel analogue of statine. J Med Chem 28:1779-90 (1986)  
Target
Name:
Renin
Synonyms:
RENI_RAT Ren1
Type:
PROTEIN
Mol. Mass.:
44272.67
Organism:
Rhizopus chinensis
Description:
ChEMBL_193377
Residue:
402
  
Inhibitor
Name:
BDBM50405191
Synonyms:
CHEMBL269752
Type:
Small organic molecule
Emp. Form.:
C54H77N13O9
Mol. Mass.:
1052.2709
SMILES:
CC[C@](C)(N)C(=O)N[C@@H](Cc1c[nH]cn1)C(=O)N1CCC[C@H]1C(=O)N[C@@H](Cc1ccccc1)C(=O)N[C@@H](Cc1c[nH]cn1)C(=O)NC(CC(C)C)C(O)CC(=O)N[C@@H](CC(C)C)C(=O)N[C@@H](Cc1ccccc1)C(N)=O
: