Target
Transporter
Ligand
BDBM50367557
Substrate
Meas. Tech.
ChEBML_193336
Ki
1.4±n/a nM
Citation
 Maryanoff, BEMcComsey, DFGardocki, JFShank, RPCostanzo, MJNortey, SOSchneider, CRSetler, PE Pyrroloisoquinoline antidepressants. 2. In-depth exploration of structure-activity relationships. J Med Chem 30:1433-54 (1987)  
Target
Name:
Transporter
Synonyms:
Monoamine transporters; Norepininephrine & dopamine | Norepinephrine Monoamine transporters
Type:
PROTEIN
Mol. Mass.:
66787.87
Organism:
Rattus norvegicus
Description:
ChEMBL_1463061
Residue:
597
  
Inhibitor
Name:
BDBM50367557
Synonyms:
CHEMBL1743767
Type:
Small organic molecule
Emp. Form.:
C16H17NS
Mol. Mass.:
255.378
SMILES:
C1C[C@@H]2N(C1)C[C@@H](c1sccc21)c1ccccc1
: