Target
Sodium-dependent serotonin transporter
Ligand
BDBM50021897
Substrate
Meas. Tech.
ChEBML_193337
Ki
1±n/a nM
Citation
 Maryanoff, BEMcComsey, DFGardocki, JFShank, RPCostanzo, MJNortey, SOSchneider, CRSetler, PE Pyrroloisoquinoline antidepressants. 2. In-depth exploration of structure-activity relationships. J Med Chem 30:1433-54 (1987)  
Target
Name:
Sodium-dependent serotonin transporter
Synonyms:
5-HT Transporter 5HT transporter Anandamid membrane transporter, AMT Monoamine transporters; Norepinephrine & serotonin Slc6a4 Sodium-dependent serotonin transporter (SERT) | imipramine receptor
Type:
Multi-pass membrane protein
Mol. Mass.:
70168.43
Organism:
Rattus norvegicus (rat)
Description:
P31652
Residue:
630
  
Inhibitor
Name:
BDBM50021897
Synonyms:
6-(4-Ethynyl-phenyl)-1,2,3,5,6,10b-hexahydro-pyrrolo[2,1-a]isoquinoline;HCl | CHEMBL286312
Type:
Small organic molecule
Emp. Form.:
C20H19N
Mol. Mass.:
273.3716
SMILES:
C#Cc1ccc(cc1)[C@@H]1CN2CCC[C@@H]2c2ccccc12
: